{"text_format":"1","workbook":"xlsx","n_sheets":4,"sheets":["Instructions","Front Sheet","Key Modelling Features","Validations"],"not_rendered":{"charts":0,"images":1,"macros":1,"external_links":0,"defined_names":12,"comments":0,"pivot_tables":0},"unopened":[],"bounds":{"document_bytes":16777216,"sheet_cells":100000,"rows_first":2000,"rows_last":500,"rows_between":2000,"halvings":0,"cell_chars":16384,"cell_head_chars":4096},"cells_cut":0,"cells_raw":0,"read":"whole","date_system":"1900"}

{"sheet":"Instructions","index":0,"n_rows":4,"n_cols":2,"rows_kept":4,"cut":false,"hidden":false,"merged":[[9,1,9,14],[2,1,2,5],[3,1,7,5]]}
[]
[]
[null,"Instructions"]
[null,"Managing agents should base any information populated in this file on the data submitted with the latest LCR. \nAny cells shaded in light blue are for managing agents to edit. \nIn the Key Modelling Features tab:\n- Please select an option from the drop-downs in column E for every question. Please do not adjust the options available; either select the most relevant option or Other if available. \n- Provide further detail in free text in column F\n- Reference your documentation in column G, to signpost to more detailed information.\nPlease ensure any documentation which has been referenced has been submitted to MRC, via the capital submission or else to SecureStore."]

{"sheet":"Front Sheet","index":1,"n_rows":11,"n_cols":8,"rows_kept":11,"cut":false,"hidden":false,"merged":[[10,2,10,4],[6,2,6,4],[2,2,2,4],[3,2,3,4],[4,2,4,4],[5,2,5,4]]}
[]
[null,{"$f":"\"Syndicate SCR for \"&Year&\" YoA  – Key Modelling Features\"","v":"Syndicate SCR for 2022 YoA  – Key Modelling Features"}]
[null," Agent name"]
[null," Syndicate number"]
[null," Completed by / Contact name"]
[null," Contact email"]
[null," Date of completion"]
[null,null,null,null,null,null,null,2022]
[]
[null,"Key"]
[null,"Do not fill"]

{"sheet":"Key Modelling Features","index":2,"n_rows":94,"n_cols":18,"rows_kept":94,"cut":false,"hidden":false,"merged":[[74,0,78,0],[72,0,73,0],[79,0,93,0],[65,0,71,0],[1,0,37,0],[38,0,51,0],[52,0,64,0]]}
["Risk category","No.","Question","Instruction","Please select","Further information/comments","Link to relevant documents",null,"Please Select","Further Information/Comments",null,null,"Validation"]
["Insurance risk",{"$f":"Validations!D4","v":"1.1"},"Does the syndicate simulate gross losses and explicitly model outwards reinsurance programme for future business?",null,null,null,null,null,null,null,null,null,{"$f":"IF(ISBLANK(INDEX(Validations!E$4:E$96,MATCH($B2,Validations!$D$4:$D$96,0))),\"\",INDEX(Validations!E$4:E$96,MATCH($B2,Validations!$D$4:$D$96,0)))","v":"Yes"},{"$f":"IF(ISBLANK(INDEX(Validations!F$4:F$96,MATCH($B2,Validations!$D$4:$D$96,0))),\"\",INDEX(Validations!F$4:F$96,MATCH($B2,Validations!$D$4:$D$96,0)))","v":"No"},{"$f":"IF(ISBLANK(INDEX(Validations!G$4:G$96,MATCH($B2,Validations!$D$4:$D$96,0))),\"\",INDEX(Validations!G$4:G$96,MATCH($B2,Validations!$D$4:$D$96,0)))","v":"N/A"},{"$f":"IF(ISBLANK(INDEX(Validations!H$4:H$96,MATCH($B2,Validations!$D$4:$D$96,0))),\"\",INDEX(Validations!H$4:H$96,MATCH($B2,Validations!$D$4:$D$96,0)))","v":""},{"$f":"IF(ISBLANK(INDEX(Validations!I$4:I$96,MATCH($B2,Validations!$D$4:$D$96,0))),\"\",INDEX(Validations!I$4:I$96,MATCH($B2,Validations!$D$4:$D$96,0)))","v":""},{"$f":"IF(ISBLANK(INDEX(Validations!J$4:J$96,MATCH($B2,Validations!$D$4:$D$96,0))),\"\",INDEX(Validations!J$4:J$96,MATCH($B2,Validations!$D$4:$D$96,0)))","v":""}]
[null,{"$f":"Validations!D5","v":"1.2"},"How is reinsurance exhaustion, including the potential this arises from reinsurance shared with other legal entities within the Group, included within the model","Please provide more detail",null,null,null,null,null,null,null,null,{"$f":"IF(ISBLANK(INDEX(Validations!E$4:E$96,MATCH($B3,Validations!$D$4:$D$96,0))),\"\",INDEX(Validations!E$4:E$96,MATCH($B3,Validations!$D$4:$D$96,0)))","v":"Explicit modelling"},{"$f":"IF(ISBLANK(INDEX(Validations!F$4:F$96,MATCH($B3,Validations!$D$4:$D$96,0))),\"\",INDEX(Validations!F$4:F$96,MATCH($B3,Validations!$D$4:$D$96,0)))","v":"Implicit modelling"},{"$f":"IF(ISBLANK(INDEX(Validations!G$4:G$96,MATCH($B3,Validations!$D$4:$D$96,0))),\"\",INDEX(Validations!G$4:G$96,MATCH($B3,Validations!$D$4:$D$96,0)))","v":"Model adjustment"},{"$f":"IF(ISBLANK(INDEX(Validations!H$4:H$96,MATCH($B3,Validations!$D$4:$D$96,0))),\"\",INDEX(Validations!H$4:H$96,MATCH($B3,Validations!$D$4:$D$96,0)))","v":"Other method"},{"$f":"IF(ISBLANK(INDEX(Validations!I$4:I$96,MATCH($B3,Validations!$D$4:$D$96,0))),\"\",INDEX(Validations!I$4:I$96,MATCH($B3,Validations!$D$4:$D$96,0)))","v":"Not modelled"},{"$f":"IF(ISBLANK(INDEX(Validations!J$4:J$96,MATCH($B3,Validations!$D$4:$D$96,0))),\"\",INDEX(Validations!J$4:J$96,MATCH($B3,Validations!$D$4:$D$96,0)))","v":""}]
[null,{"$f":"Validations!D6","v":"1.3"},"Does capital benefit materially from an Adverse Development Cover (ADC) or stop loss? ","If yes please describe the cover and amount of benefit to capital. Note: material in this context is cover that provides a 10% or more benefit to ultimate SCR",null,null,null,null,null,null,null,null,{"$f":"IF(ISBLANK(INDEX(Validations!E$4:E$96,MATCH($B4,Validations!$D$4:$D$96,0))),\"\",INDEX(Validations!E$4:E$96,MATCH($B4,Validations!$D$4:$D$96,0)))","v":"Yes"},{"$f":"IF(ISBLANK(INDEX(Validations!F$4:F$96,MATCH($B4,Validations!$D$4:$D$96,0))),\"\",INDEX(Validations!F$4:F$96,MATCH($B4,Validations!$D$4:$D$96,0)))","v":"No"},{"$f":"IF(ISBLANK(INDEX(Validations!G$4:G$96,MATCH($B4,Validations!$D$4:$D$96,0))),\"\",INDEX(Validations!G$4:G$96,MATCH($B4,Validations!$D$4:$D$96,0)))","v":""},{"$f":"IF(ISBLANK(INDEX(Validations!H$4:H$96,MATCH($B4,Validations!$D$4:$D$96,0))),\"\",INDEX(Validations!H$4:H$96,MATCH($B4,Validations!$D$4:$D$96,0)))","v":""},{"$f":"IF(ISBLANK(INDEX(Validations!I$4:I$96,MATCH($B4,Validations!$D$4:$D$96,0))),\"\",INDEX(Validations!I$4:I$96,MATCH($B4,Validations!$D$4:$D$96,0)))","v":""},{"$f":"IF(ISBLANK(INDEX(Validations!J$4:J$96,MATCH($B4,Validations!$D$4:$D$96,0))),\"\",INDEX(Validations!J$4:J$96,MATCH($B4,Validations!$D$4:$D$96,0)))","v":""}]
[null,{"$f":"Validations!D7","v":"1.4"},"What allowance is made in the parameterisation and model for events that aren't captured in the underlying data source(s) i.e. ENIDs","Please provide more detail for all insurance risk related allowances i.e. non-cat, reserve and cat risk",null,null,null,null,null,null,null,null,{"$f":"IF(ISBLANK(INDEX(Validations!E$4:E$96,MATCH($B5,Validations!$D$4:$D$96,0))),\"\",INDEX(Validations!E$4:E$96,MATCH($B5,Validations!$D$4:$D$96,0)))","v":"Explicit allowance"},{"$f":"IF(ISBLANK(INDEX(Validations!F$4:F$96,MATCH($B5,Validations!$D$4:$D$96,0))),\"\",INDEX(Validations!F$4:F$96,MATCH($B5,Validations!$D$4:$D$96,0)))","v":"Implicit allowance"},{"$f":"IF(ISBLANK(INDEX(Validations!G$4:G$96,MATCH($B5,Validations!$D$4:$D$96,0))),\"\",INDEX(Validations!G$4:G$96,MATCH($B5,Validations!$D$4:$D$96,0)))","v":"Not captured"},{"$f":"IF(ISBLANK(INDEX(Validations!H$4:H$96,MATCH($B5,Validations!$D$4:$D$96,0))),\"\",INDEX(Validations!H$4:H$96,MATCH($B5,Validations!$D$4:$D$96,0)))","v":"Other"},{"$f":"IF(ISBLANK(INDEX(Validations!I$4:I$96,MATCH($B5,Validations!$D$4:$D$96,0))),\"\",INDEX(Validations!I$4:I$96,MATCH($B5,Validations!$D$4:$D$96,0)))","v":""},{"$f":"IF(ISBLANK(INDEX(Validations!J$4:J$96,MATCH($B5,Validations!$D$4:$D$96,0))),\"\",INDEX(Validations!J$4:J$96,MATCH($B5,Validations!$D$4:$D$96,0)))","v":""}]
[null,{"$f":"Validations!D8","v":"1.5"},"Does the syndicate model attritional losses separately? ","If yes, state distribution used",null,null,null,null,null,null,null,null,{"$f":"IF(ISBLANK(INDEX(Validations!E$4:E$96,MATCH($B6,Validations!$D$4:$D$96,0))),\"\",INDEX(Validations!E$4:E$96,MATCH($B6,Validations!$D$4:$D$96,0)))","v":"Yes"},{"$f":"IF(ISBLANK(INDEX(Validations!F$4:F$96,MATCH($B6,Validations!$D$4:$D$96,0))),\"\",INDEX(Validations!F$4:F$96,MATCH($B6,Validations!$D$4:$D$96,0)))","v":"No"},{"$f":"IF(ISBLANK(INDEX(Validations!G$4:G$96,MATCH($B6,Validations!$D$4:$D$96,0))),\"\",INDEX(Validations!G$4:G$96,MATCH($B6,Validations!$D$4:$D$96,0)))","v":""},{"$f":"IF(ISBLANK(INDEX(Validations!H$4:H$96,MATCH($B6,Validations!$D$4:$D$96,0))),\"\",INDEX(Validations!H$4:H$96,MATCH($B6,Validations!$D$4:$D$96,0)))","v":""},{"$f":"IF(ISBLANK(INDEX(Validations!I$4:I$96,MATCH($B6,Validations!$D$4:$D$96,0))),\"\",INDEX(Validations!I$4:I$96,MATCH($B6,Validations!$D$4:$D$96,0)))","v":""},{"$f":"IF(ISBLANK(INDEX(Validations!J$4:J$96,MATCH($B6,Validations!$D$4:$D$96,0))),\"\",INDEX(Validations!J$4:J$96,MATCH($B6,Validations!$D$4:$D$96,0)))","v":""}]
[null,{"$f":"Validations!D9","v":"1.6"},"Are attritional losses modelled in aggregate or by class?",null,null,null,null,null,null,null,null,null,{"$f":"IF(ISBLANK(INDEX(Validations!E$4:E$96,MATCH($B7,Validations!$D$4:$D$96,0))),\"\",INDEX(Validations!E$4:E$96,MATCH($B7,Validations!$D$4:$D$96,0)))","v":"Aggregate"},{"$f":"IF(ISBLANK(INDEX(Validations!F$4:F$96,MATCH($B7,Validations!$D$4:$D$96,0))),\"\",INDEX(Validations!F$4:F$96,MATCH($B7,Validations!$D$4:$D$96,0)))","v":"Class"},{"$f":"IF(ISBLANK(INDEX(Validations!G$4:G$96,MATCH($B7,Validations!$D$4:$D$96,0))),\"\",INDEX(Validations!G$4:G$96,MATCH($B7,Validations!$D$4:$D$96,0)))","v":""},{"$f":"IF(ISBLANK(INDEX(Validations!H$4:H$96,MATCH($B7,Validations!$D$4:$D$96,0))),\"\",INDEX(Validations!H$4:H$96,MATCH($B7,Validations!$D$4:$D$96,0)))","v":""},{"$f":"IF(ISBLANK(INDEX(Validations!I$4:I$96,MATCH($B7,Validations!$D$4:$D$96,0))),\"\",INDEX(Validations!I$4:I$96,MATCH($B7,Validations!$D$4:$D$96,0)))","v":""},{"$f":"IF(ISBLANK(INDEX(Validations!J$4:J$96,MATCH($B7,Validations!$D$4:$D$96,0))),\"\",INDEX(Validations!J$4:J$96,MATCH($B7,Validations!$D$4:$D$96,0)))","v":""}]
[null,{"$f":"Validations!D10","v":"1.7"},"Are large losses modelled by the syndicate?",null,null,null,null,null,null,null,null,null,{"$f":"IF(ISBLANK(INDEX(Validations!E$4:E$96,MATCH($B8,Validations!$D$4:$D$96,0))),\"\",INDEX(Validations!E$4:E$96,MATCH($B8,Validations!$D$4:$D$96,0)))","v":"Yes"},{"$f":"IF(ISBLANK(INDEX(Validations!F$4:F$96,MATCH($B8,Validations!$D$4:$D$96,0))),\"\",INDEX(Validations!F$4:F$96,MATCH($B8,Validations!$D$4:$D$96,0)))","v":"No"},{"$f":"IF(ISBLANK(INDEX(Validations!G$4:G$96,MATCH($B8,Validations!$D$4:$D$96,0))),\"\",INDEX(Validations!G$4:G$96,MATCH($B8,Validations!$D$4:$D$96,0)))","v":""},{"$f":"IF(ISBLANK(INDEX(Validations!H$4:H$96,MATCH($B8,Validations!$D$4:$D$96,0))),\"\",INDEX(Validations!H$4:H$96,MATCH($B8,Validations!$D$4:$D$96,0)))","v":""},{"$f":"IF(ISBLANK(INDEX(Validations!I$4:I$96,MATCH($B8,Validations!$D$4:$D$96,0))),\"\",INDEX(Validations!I$4:I$96,MATCH($B8,Validations!$D$4:$D$96,0)))","v":""},{"$f":"IF(ISBLANK(INDEX(Validations!J$4:J$96,MATCH($B8,Validations!$D$4:$D$96,0))),\"\",INDEX(Validations!J$4:J$96,MATCH($B8,Validations!$D$4:$D$96,0)))","v":""}]
[null,{"$f":"Validations!D11","v":"1.8"},"Select the approach taken to model large losses. ","If other, please provide detail",null,null,null,null,null,null,null,null,{"$f":"IF(ISBLANK(INDEX(Validations!E$4:E$96,MATCH($B9,Validations!$D$4:$D$96,0))),\"\",INDEX(Validations!E$4:E$96,MATCH($B9,Validations!$D$4:$D$96,0)))","v":"Frequency/Severity"},{"$f":"IF(ISBLANK(INDEX(Validations!F$4:F$96,MATCH($B9,Validations!$D$4:$D$96,0))),\"\",INDEX(Validations!F$4:F$96,MATCH($B9,Validations!$D$4:$D$96,0)))","v":"Aggregate"},{"$f":"IF(ISBLANK(INDEX(Validations!G$4:G$96,MATCH($B9,Validations!$D$4:$D$96,0))),\"\",INDEX(Validations!G$4:G$96,MATCH($B9,Validations!$D$4:$D$96,0)))","v":"Other"},{"$f":"IF(ISBLANK(INDEX(Validations!H$4:H$96,MATCH($B9,Validations!$D$4:$D$96,0))),\"\",INDEX(Validations!H$4:H$96,MATCH($B9,Validations!$D$4:$D$96,0)))","v":"N/A"},{"$f":"IF(ISBLANK(INDEX(Validations!I$4:I$96,MATCH($B9,Validations!$D$4:$D$96,0))),\"\",INDEX(Validations!I$4:I$96,MATCH($B9,Validations!$D$4:$D$96,0)))","v":""},{"$f":"IF(ISBLANK(INDEX(Validations!J$4:J$96,MATCH($B9,Validations!$D$4:$D$96,0))),\"\",INDEX(Validations!J$4:J$96,MATCH($B9,Validations!$D$4:$D$96,0)))","v":""}]
[null,{"$f":"Validations!D12","v":"1.9"},"Select the large loss distribution generally used for frequency. ","• If other, please state which.\n• If multiple distributions are used, select most applicable. State any other materially used distributions in comments. ",null,null,null,null,null,null,null,null,{"$f":"IF(ISBLANK(INDEX(Validations!E$4:E$96,MATCH($B10,Validations!$D$4:$D$96,0))),\"\",INDEX(Validations!E$4:E$96,MATCH($B10,Validations!$D$4:$D$96,0)))","v":"Poisson"},{"$f":"IF(ISBLANK(INDEX(Validations!F$4:F$96,MATCH($B10,Validations!$D$4:$D$96,0))),\"\",INDEX(Validations!F$4:F$96,MATCH($B10,Validations!$D$4:$D$96,0)))","v":"Negative Binomial "},{"$f":"IF(ISBLANK(INDEX(Validations!G$4:G$96,MATCH($B10,Validations!$D$4:$D$96,0))),\"\",INDEX(Validations!G$4:G$96,MATCH($B10,Validations!$D$4:$D$96,0)))","v":"Empirical"},{"$f":"IF(ISBLANK(INDEX(Validations!H$4:H$96,MATCH($B10,Validations!$D$4:$D$96,0))),\"\",INDEX(Validations!H$4:H$96,MATCH($B10,Validations!$D$4:$D$96,0)))","v":"Other"},{"$f":"IF(ISBLANK(INDEX(Validations!I$4:I$96,MATCH($B10,Validations!$D$4:$D$96,0))),\"\",INDEX(Validations!I$4:I$96,MATCH($B10,Validations!$D$4:$D$96,0)))","v":"N/A"},{"$f":"IF(ISBLANK(INDEX(Validations!J$4:J$96,MATCH($B10,Validations!$D$4:$D$96,0))),\"\",INDEX(Validations!J$4:J$96,MATCH($B10,Validations!$D$4:$D$96,0)))","v":""}]
[null,{"$f":"Validations!D13","v":"1.10"},"Select the large loss distribution generally used for severity. ","• If other, please state which.\n• If multiple distributions are used, select most applicable. State any other materially used distributions in comments. ",null,null,null,null,null,null,null,null,{"$f":"IF(ISBLANK(INDEX(Validations!E$4:E$96,MATCH($B11,Validations!$D$4:$D$96,0))),\"\",INDEX(Validations!E$4:E$96,MATCH($B11,Validations!$D$4:$D$96,0)))","v":"Lognormal"},{"$f":"IF(ISBLANK(INDEX(Validations!F$4:F$96,MATCH($B11,Validations!$D$4:$D$96,0))),\"\",INDEX(Validations!F$4:F$96,MATCH($B11,Validations!$D$4:$D$96,0)))","v":"Pareto"},{"$f":"IF(ISBLANK(INDEX(Validations!G$4:G$96,MATCH($B11,Validations!$D$4:$D$96,0))),\"\",INDEX(Validations!G$4:G$96,MATCH($B11,Validations!$D$4:$D$96,0)))","v":"Gamma"},{"$f":"IF(ISBLANK(INDEX(Validations!H$4:H$96,MATCH($B11,Validations!$D$4:$D$96,0))),\"\",INDEX(Validations!H$4:H$96,MATCH($B11,Validations!$D$4:$D$96,0)))","v":"Other"},{"$f":"IF(ISBLANK(INDEX(Validations!I$4:I$96,MATCH($B11,Validations!$D$4:$D$96,0))),\"\",INDEX(Validations!I$4:I$96,MATCH($B11,Validations!$D$4:$D$96,0)))","v":"N/A"},{"$f":"IF(ISBLANK(INDEX(Validations!J$4:J$96,MATCH($B11,Validations!$D$4:$D$96,0))),\"\",INDEX(Validations!J$4:J$96,MATCH($B11,Validations!$D$4:$D$96,0)))","v":""}]
[null,{"$f":"Validations!D14","v":"1.11"},"How are non-nat cat events modelled?","If other, please provide more detail",null,null,null,null,null,null,null,null,{"$f":"IF(ISBLANK(INDEX(Validations!E$4:E$96,MATCH($B12,Validations!$D$4:$D$96,0))),\"\",INDEX(Validations!E$4:E$96,MATCH($B12,Validations!$D$4:$D$96,0)))","v":"Implicitly within parameter uplifts"},{"$f":"IF(ISBLANK(INDEX(Validations!F$4:F$96,MATCH($B12,Validations!$D$4:$D$96,0))),\"\",INDEX(Validations!F$4:F$96,MATCH($B12,Validations!$D$4:$D$96,0)))","v":"Explicit allowance in large or non-cat parameters"},{"$f":"IF(ISBLANK(INDEX(Validations!G$4:G$96,MATCH($B12,Validations!$D$4:$D$96,0))),\"\",INDEX(Validations!G$4:G$96,MATCH($B12,Validations!$D$4:$D$96,0)))","v":"Explicit modelling of non-nat cat events"},{"$f":"IF(ISBLANK(INDEX(Validations!H$4:H$96,MATCH($B12,Validations!$D$4:$D$96,0))),\"\",INDEX(Validations!H$4:H$96,MATCH($B12,Validations!$D$4:$D$96,0)))","v":"Not modelled"},{"$f":"IF(ISBLANK(INDEX(Validations!I$4:I$96,MATCH($B12,Validations!$D$4:$D$96,0))),\"\",INDEX(Validations!I$4:I$96,MATCH($B12,Validations!$D$4:$D$96,0)))","v":"Other"},{"$f":"IF(ISBLANK(INDEX(Validations!J$4:J$96,MATCH($B12,Validations!$D$4:$D$96,0))),\"\",INDEX(Validations!J$4:J$96,MATCH($B12,Validations!$D$4:$D$96,0)))","v":""}]
[null,{"$f":"Validations!D15","v":"1.12"},"Are non-nat cat losses correlated with other parts of insurance risk?","Please list the sources of implicit and explicit dependencies in the model",null,null,null,null,null,null,null,null,{"$f":"IF(ISBLANK(INDEX(Validations!E$4:E$96,MATCH($B13,Validations!$D$4:$D$96,0))),\"\",INDEX(Validations!E$4:E$96,MATCH($B13,Validations!$D$4:$D$96,0)))","v":"Yes, implicitly via class level dependency"},{"$f":"IF(ISBLANK(INDEX(Validations!F$4:F$96,MATCH($B13,Validations!$D$4:$D$96,0))),\"\",INDEX(Validations!F$4:F$96,MATCH($B13,Validations!$D$4:$D$96,0)))","v":"Yes, with other loss types within a class and between classes"},{"$f":"IF(ISBLANK(INDEX(Validations!G$4:G$96,MATCH($B13,Validations!$D$4:$D$96,0))),\"\",INDEX(Validations!G$4:G$96,MATCH($B13,Validations!$D$4:$D$96,0)))","v":"Other"},{"$f":"IF(ISBLANK(INDEX(Validations!H$4:H$96,MATCH($B13,Validations!$D$4:$D$96,0))),\"\",INDEX(Validations!H$4:H$96,MATCH($B13,Validations!$D$4:$D$96,0)))","v":""},{"$f":"IF(ISBLANK(INDEX(Validations!I$4:I$96,MATCH($B13,Validations!$D$4:$D$96,0))),\"\",INDEX(Validations!I$4:I$96,MATCH($B13,Validations!$D$4:$D$96,0)))","v":""},{"$f":"IF(ISBLANK(INDEX(Validations!J$4:J$96,MATCH($B13,Validations!$D$4:$D$96,0))),\"\",INDEX(Validations!J$4:J$96,MATCH($B13,Validations!$D$4:$D$96,0)))","v":""}]
[null,{"$f":"Validations!D16","v":"1.13"},"Are you able to quantify non-nat cat contribution to tail dependency in insurance risk and overall capital?","If you're not able to explicitly quantify, please give further detail",null,null,null,null,null,null,null,null,{"$f":"IF(ISBLANK(INDEX(Validations!E$4:E$96,MATCH($B14,Validations!$D$4:$D$96,0))),\"\",INDEX(Validations!E$4:E$96,MATCH($B14,Validations!$D$4:$D$96,0)))","v":"Yes, explicitly "},{"$f":"IF(ISBLANK(INDEX(Validations!F$4:F$96,MATCH($B14,Validations!$D$4:$D$96,0))),\"\",INDEX(Validations!F$4:F$96,MATCH($B14,Validations!$D$4:$D$96,0)))","v":"Yes, approximately"},{"$f":"IF(ISBLANK(INDEX(Validations!G$4:G$96,MATCH($B14,Validations!$D$4:$D$96,0))),\"\",INDEX(Validations!G$4:G$96,MATCH($B14,Validations!$D$4:$D$96,0)))","v":"No"},{"$f":"IF(ISBLANK(INDEX(Validations!H$4:H$96,MATCH($B14,Validations!$D$4:$D$96,0))),\"\",INDEX(Validations!H$4:H$96,MATCH($B14,Validations!$D$4:$D$96,0)))","v":""},{"$f":"IF(ISBLANK(INDEX(Validations!I$4:I$96,MATCH($B14,Validations!$D$4:$D$96,0))),\"\",INDEX(Validations!I$4:I$96,MATCH($B14,Validations!$D$4:$D$96,0)))","v":""},{"$f":"IF(ISBLANK(INDEX(Validations!J$4:J$96,MATCH($B14,Validations!$D$4:$D$96,0))),\"\",INDEX(Validations!J$4:J$96,MATCH($B14,Validations!$D$4:$D$96,0)))","v":""}]
[null,{"$f":"Validations!D17","v":"1.14"},"Are PPOs modelled separately?","If yes, provide more detail",null,null,null,null,null,null,null,null,{"$f":"IF(ISBLANK(INDEX(Validations!E$4:E$96,MATCH($B15,Validations!$D$4:$D$96,0))),\"\",INDEX(Validations!E$4:E$96,MATCH($B15,Validations!$D$4:$D$96,0)))","v":"Yes, explicitly"},{"$f":"IF(ISBLANK(INDEX(Validations!F$4:F$96,MATCH($B15,Validations!$D$4:$D$96,0))),\"\",INDEX(Validations!F$4:F$96,MATCH($B15,Validations!$D$4:$D$96,0)))","v":"No, no material exposure"},{"$f":"IF(ISBLANK(INDEX(Validations!G$4:G$96,MATCH($B15,Validations!$D$4:$D$96,0))),\"\",INDEX(Validations!G$4:G$96,MATCH($B15,Validations!$D$4:$D$96,0)))","v":"No, not material to capital"},{"$f":"IF(ISBLANK(INDEX(Validations!H$4:H$96,MATCH($B15,Validations!$D$4:$D$96,0))),\"\",INDEX(Validations!H$4:H$96,MATCH($B15,Validations!$D$4:$D$96,0)))","v":"No"},{"$f":"IF(ISBLANK(INDEX(Validations!I$4:I$96,MATCH($B15,Validations!$D$4:$D$96,0))),\"\",INDEX(Validations!I$4:I$96,MATCH($B15,Validations!$D$4:$D$96,0)))","v":""},{"$f":"IF(ISBLANK(INDEX(Validations!J$4:J$96,MATCH($B15,Validations!$D$4:$D$96,0))),\"\",INDEX(Validations!J$4:J$96,MATCH($B15,Validations!$D$4:$D$96,0)))","v":""}]
{"$rows_left_out":80}
{"sheet":"Validations","index":3,"n_rows":96,"n_cols":21,"rows_kept":96,"cut":false,"hidden":true,"merged":[]}
[]
[]
["Risk","Section","Question","Reference","Validation 1","Validation 2","Validation 3","Validation 4","Validation 5","Validation 6"]
["Insurance",1,{"$f":"COUNTIFS(A$4:A4,A4)","v":1},{"$f":"B4&\".\"&C4","v":"1.1"},"Yes","No","N/A"]
["Insurance",1,{"$f":"COUNTIFS(A$4:A5,A5)","v":2},"1.2","Explicit modelling","Implicit modelling","Model adjustment","Other method","Not modelled"]
["Insurance",1,{"$f":"COUNTIFS(A$4:A6,A6)","v":3},"1.3","Yes","No"]
["Insurance",1,{"$f":"COUNTIFS(A$4:A7,A7)","v":4},"1.4","Explicit allowance","Implicit allowance","Not captured","Other"]
["Insurance",1,{"$f":"COUNTIFS(A$4:A8,A8)","v":5},"1.5","Yes","No"]
["Insurance",1,{"$f":"COUNTIFS(A$4:A9,A9)","v":6},"1.6","Aggregate","Class"]
["Insurance",1,{"$f":"COUNTIFS(A$4:A10,A10)","v":7},"1.7","Yes","No"]
["Insurance",1,{"$f":"COUNTIFS(A$4:A11,A11)","v":8},"1.8","Frequency/Severity","Aggregate","Other","N/A"]
["Insurance",1,{"$f":"COUNTIFS(A$4:A12,A12)","v":9},"1.9","Poisson","Negative Binomial ","Empirical","Other","N/A"]
["Insurance",1,{"$f":"COUNTIFS(A$4:A13,A13)","v":10},"1.10","Lognormal","Pareto","Gamma","Other","N/A"]
["Insurance",1,{"$f":"COUNTIFS(A$4:A14,A14)","v":11},{"$f":"B14&\".\"&C14","v":"1.11"},"Implicitly within parameter uplifts","Explicit allowance in large or non-cat parameters","Explicit modelling of non-nat cat events","Not modelled","Other"]
["Insurance",1,{"$f":"COUNTIFS(A$4:A15,A15)","v":12},"1.12","Yes, implicitly via class level dependency","Yes, with other loss types within a class and between classes","Other"]
{"$rows_left_out":81}