{"text_format":"1","workbook":"xlsx","n_sheets":5,"sheets":["Front Sheet","Instructions","Inputs","Analysis of Change","Risk vs exp Calc"],"not_rendered":{"charts":0,"images":1,"macros":1,"external_links":0,"defined_names":19,"comments":0,"pivot_tables":0},"unopened":[],"bounds":{"document_bytes":16777216,"sheet_cells":100000,"rows_first":2000,"rows_last":500,"rows_between":2000,"halvings":0,"cell_chars":16384,"cell_head_chars":4096},"cells_cut":0,"cells_raw":0,"read":"whole","date_system":"1900"}

{"sheet":"Front Sheet","index":0,"n_rows":12,"n_cols":5,"rows_kept":12,"cut":false,"hidden":false,"merged":[[9,2,11,2],[2,2,2,4],[3,2,3,4],[4,2,4,4],[5,2,5,4],[6,2,6,4]]}
[]
[null,"syndicate scr for 2016 yoa  – Analysis of Change"]
[null," Agent Name"]
[null," Syndicate Number"]
[null," Completed By / Contact Name"]
[null," Contact Telephone Number"]
[null," Date of Completion"]
[]
[]
[null,null,"Links to worksheets:",null,"Inputs"]
[null,null,null,null,"Instructions"]
[null,null,null,null,"Analysis of Change"]

{"sheet":"Instructions","index":1,"n_rows":42,"n_cols":13,"rows_kept":42,"cut":false,"hidden":false,"merged":[[39,11,41,11],[1,2,1,12]]}
[]
[null,null,{"$f":"AgentName&\" - s\"&TEXT(Synd,\"0000\")","v":" - s0000"}]
[]
[null,null,"Step 1: Create a folder on your network or hard drive for the csv downloads of the LCR. Use this folder for all downloads.  "]
[null,null,"Step 2: Save 2016_SCR_Analysis of Change_SYND.xlsm (this workbook) in the folder. Replace \"SYND\" with the number of your syndicate (including any leading zeros)."]
[null,null,"Step 3: Complete the \"Front Sheet\" for your syndicate."]
[null,null,"Step 4: Open Core market Returns (\"CMR\")."]
[null,null,"Step 5: Go to the LCR homepage."]
[null,null,"Step 6. Go to Step 7 for the July (draft) submission OR Step 8 for September and subsequent submissions."]
[]
[null,null,"Step 7. Download the files for the Analysis of Change (\"AOC\") for the July submission. "]
[null,null,null,"a. Download the csv file for the July submission for the prospective YOA "]
[null,null,null,null,"i. Go to the Controls page"]
[null,null,null,null,"ii. Click \"Extract\""]
[null,null,null,null,"iii. Click \"Select All\""]
[null,null,null,null,"iv. Uncheck the \"Exclude base elements with '_LCALC' and '_LTOTAL' \" box"]
[null,null,null,null,"v. Click \"Generate csv\""]
[null,null,null,null,"vi. Save the csv file in the folder you created in Step 1"]
[null,null,null,null,"vii. Enter the information of the csv download in the \"Inputs\" sheet in the row for File 1. The file name must include the .csv extension."]
[null,null,null,"b. Download the csv file for the final submission for the current YOA "]
[null,null,null,null,"i. Go to \"Archives\""]
[null,null,null,null,"ii. Click on \"CSV\" for the latest submission for the current YOA (from March of the current year if submitted; otherwise the final submission made last year)"]
[null,null,null,null,"iii. Save the csv file in the folder you created in Step 1"]
[null,null,null,null,"iv. Enter the information of the csv download file in the \"Inputs\" sheet in the row for File 2. The file name must include the .csv extension."]
[null,null,"Step 8. Download the files for the AOC for the September or subsequent submissions. "]
[null,null,null,"a. Repeat Step 7.a for the latest submission for the prospective YOA (from September, or later if a re-submission is being made) "]
[null,null,null,"b. Repeat Step 7.a i-vi. For step vii, enter the information in the row for File 2"]
[null,null,null,"c. Repeat Step 7.b i-iii. For step iv, enter the information in the row for File 3"]
[]
[null,null,"Step 9: In 2016_SCR_Analysis of Change_SYND.xlsm, select the Excel options \"Enable content\" and \"Enable Macros\". "]
{"$rows_left_out":13}
{"sheet":"Inputs","index":2,"n_rows":19,"n_cols":69,"rows_kept":19,"cut":false,"hidden":false,"merged":[[16,8,18,8],[1,2,1,9]]}
[]
[null,null,{"$f":"AgentName&\" - s\"&TEXT(Synd,\"0000\")","v":" - s0000"}]
[]
[null,null,null,"See the \"Instructions\" sheet for details on how to complete the table."]
[null,null,null,null,null,"LCR Submission"]
[null,null,null,"File","SCR YOA","Month","Year","Edition","File Name"]
[null,null,null,1,2016,null,null,null,null,null,null,null,null,null,null,null,null,null,null,null,null,null,null,null,null,null,null,null,null,null,null,null,null,null,null,null,null,null,null,null,null,null,null,null,null,null,null,null,null,null,null,null,null,null,null,null,null,null,null,null,null,null,null,null,null,2015,"January",null,2013]
[null,null,null,2,null,null,null,null,null,null,null,null,null,null,null,null,null,null,null,null,null,null,null,null,null,null,null,null,null,null,null,null,null,null,null,null,null,null,null,null,null,null,null,null,null,null,null,null,null,null,null,null,null,null,null,null,null,null,null,null,null,null,null,null,null,2016,"February",null,2014]
[null,null,null,3,null,null,null,null,null,null,null,null,null,null,null,null,null,null,null,null,null,null,null,null,null,null,null,null,null,null,null,null,null,null,null,null,null,null,null,null,null,null,null,null,null,null,null,null,null,null,null,null,null,null,null,null,null,null,null,null,null,null,null,null,null,null,"March",null,2015]
[null,null,null,null,null,null,null,null,null,null,null,null,null,null,null,null,null,null,null,null,null,null,null,null,null,null,null,null,null,null,null,null,null,null,null,null,null,null,null,null,null,null,null,null,null,null,null,null,null,null,null,null,null,null,null,null,null,null,null,null,null,null,null,null,null,null,"April"]
[null,null,null,null,null,null,null,null,null,null,null,null,null,null,null,null,null,null,null,null,null,null,null,null,null,null,null,null,null,null,null,null,null,null,null,null,null,null,null,null,null,null,null,null,null,null,null,null,null,null,null,null,null,null,null,null,null,null,null,null,null,null,null,null,null,null,"May"]
[null,null,null,null,null,null,null,null,null,null,null,null,null,null,null,null,null,null,null,null,null,null,null,null,null,null,null,null,null,null,null,null,null,null,null,null,null,null,null,null,null,null,null,null,null,null,null,null,null,null,null,null,null,null,null,null,null,null,null,null,null,null,null,null,null,null,"June"]
[null,null,null,null,null,null,null,null,null,null,null,null,null,null,null,null,null,null,null,null,null,null,null,null,null,null,null,null,null,null,null,null,null,null,null,null,null,null,null,null,null,null,null,null,null,null,null,null,null,null,null,null,null,null,null,null,null,null,null,null,null,null,null,null,null,null,"July"]
[null,null,null,null,null,null,null,null,null,null,null,null,null,null,null,null,null,null,null,null,null,null,null,null,null,null,null,null,null,null,null,null,null,null,null,null,null,null,null,null,null,null,null,null,null,null,null,null,null,null,null,null,null,null,null,null,null,null,null,null,null,null,null,null,null,null,"August"]
[null,null,null,null,null,null,null,null,null,null,null,null,null,null,null,null,null,null,null,null,null,null,null,null,null,null,null,null,null,null,null,null,null,null,null,null,null,null,null,null,null,null,null,null,null,null,null,null,null,null,null,null,null,null,null,null,null,null,null,null,null,null,null,null,null,null,"September"]
[null,null,null,null,null,null,null,null,null,null,null,null,null,null,null,null,null,null,null,null,null,null,null,null,null,null,null,null,null,null,null,null,null,null,null,null,null,null,null,null,null,null,null,null,null,null,null,null,null,null,null,null,null,null,null,null,null,null,null,null,null,null,null,null,null,null,"October"]
[null,null,null,null,null,null,null,null,"Links to worksheets:","Front Sheet",null,null,null,null,null,null,null,null,null,null,null,null,null,null,null,null,null,null,null,null,null,null,null,null,null,null,null,null,null,null,null,null,null,null,null,null,null,null,null,null,null,null,null,null,null,null,null,null,null,null,null,null,null,null,null,null,"November"]
[null,null,null,null,null,null,null,null,null,"Instructions",null,null,null,null,null,null,null,null,null,null,null,null,null,null,null,null,null,null,null,null,null,null,null,null,null,null,null,null,null,null,null,null,null,null,null,null,null,null,null,null,null,null,null,null,null,null,null,null,null,null,null,null,null,null,null,null,"December"]
[null,null,null,null,null,null,null,null,null,"Analysis of Change"]

{"sheet":"Analysis of Change","index":3,"n_rows":101,"n_cols":29,"rows_kept":101,"cut":false,"hidden":false,"merged":[[63,2,63,8],[0,1,0,11],[2,5,2,6],[2,7,2,8],[4,2,4,8],[15,2,15,8]]}
[null,{"$f":"AgentName&\" s\"&TEXT(Synd,\"0000\")&\": LCR Analysis of Change 2016 YOA\"","v":" s0000: LCR Analysis of Change 2016 YOA"}]
[null,null,null,null,null,null,null,null,null,"(All figures are in £m)"]
[null,null,{"$f":"CONCATENATE(Inputs!$G$7,\" \",,LEFT(Inputs!$F$7,3))","v":" "},{"$f":"CONCATENATE(Inputs!$G$8,\" \",,LEFT(Inputs!$F$8,3))","v":" "},{"$f":"CONCATENATE(Inputs!$G$9,\" \",,LEFT(Inputs!$F$9,3))","v":" "},{"$f":"C3&\" vs. \"&D3","v":"  vs.  "},null,{"$f":"D3&\" vs. \"&E3","v":"  vs.  "},null,{"$f":"\"Significant movements between \"&D3&\" and \"&C3","v":"Significant movements between   and  "},{"$f":"\"Significant movements between \"&E3&\" and \"&D3","v":"Significant movements between   and  "},"Comments"]
[null,"LCR edition",{"$f":"Inputs!$H$7","v":0},{"$f":"Inputs!$H$8","v":0},{"$f":"Inputs!$H$9","v":0},"£ change","% change","£ change","% change"]
[null,null,"A. EXPOSURE & RISK MARGIN"]
[null,"Exposure and Risk Margin"]
[null,"Premium 1  [Note 1]",{"$f":"'Risk vs exp Calc'!C632","v":""},{"$f":"'Risk vs exp Calc'!D632","v":""},{"$f":"'Risk vs exp Calc'!E632","v":""},{"$f":"IFERROR(C7-D7,\"\")","v":""},{"$f":"IFERROR((C7-D7)/D7,\"\")","v":""},{"$f":"IFERROR(D7-E7,\"\")","v":""},{"$f":"IFERROR((D7-E7)/E7,\"\")","v":""}]
[null,"Premium 2  [Note 2]",{"$f":"IFERROR('Risk vs exp Calc'!C632+IF(Inputs!$E$7=2016,('Risk vs exp Calc'!C582-'Risk vs exp Calc'!C583),('Risk vs exp Calc'!C565-'Risk vs exp Calc'!C566)),\"\")","v":""},{"$f":"IFERROR('Risk vs exp Calc'!D632+IF(Inputs!$E$8=2016,('Risk vs exp Calc'!D582-'Risk vs exp Calc'!D583),('Risk vs exp Calc'!D565-'Risk vs exp Calc'!D566)),\"\")","v":""},{"$f":"IFERROR('Risk vs exp Calc'!E632+IF(Inputs!$E$9=2016,('Risk vs exp Calc'!E582-'Risk vs exp Calc'!E583),('Risk vs exp Calc'!E565-'Risk vs exp Calc'!E566)),\"\")","v":""},"","","",""]
[null,"Reserves 1  [Note 3]",{"$f":"IFERROR(('Risk vs exp Calc'!C616+'Risk vs exp Calc'!C617-'Risk vs exp Calc'!C618)-('Risk vs exp Calc'!C598+'Risk vs exp Calc'!C599-'Risk vs exp Calc'!C600),\"\")","v":""},{"$f":"IFERROR(('Risk vs exp Calc'!D616+'Risk vs exp Calc'!D617-'Risk vs exp Calc'!D618)-('Risk vs exp Calc'!D598+'Risk vs exp Calc'!D599-'Risk vs exp Calc'!D600),\"\")","v":""},{"$f":"IFERROR(('Risk vs exp Calc'!E616+'Risk vs exp Calc'!E617-'Risk vs exp Calc'!E618)-('Risk vs exp Calc'!E598+'Risk vs exp Calc'!E599-'Risk vs exp Calc'!E600),\"\")","v":""},"","","",""]
[null,"Reserves 2  [Note 4]",{"$f":"IFERROR(C9-(('Risk vs exp Calc'!C619-'Risk vs exp Calc'!C620-'Risk vs exp Calc'!C621)-('Risk vs exp Calc'!C601-'Risk vs exp Calc'!C602-'Risk vs exp Calc'!C603)),\"\")","v":""},{"$f":"IFERROR(D9-(('Risk vs exp Calc'!D619-'Risk vs exp Calc'!D620-'Risk vs exp Calc'!D621)-('Risk vs exp Calc'!D601-'Risk vs exp Calc'!D602-'Risk vs exp Calc'!D603)),\"\")","v":""},{"$f":"IFERROR(E9-(('Risk vs exp Calc'!E619-'Risk vs exp Calc'!E620-'Risk vs exp Calc'!E621)-('Risk vs exp Calc'!E601-'Risk vs exp Calc'!E602-'Risk vs exp Calc'!E603)),\"\")","v":""},"","","",""]
[null,"Premium 1 + 1/2 * Reserves 1",{"$f":"IFERROR(C7+0.5*C9,\"\")","v":""},"","","","","",""]
[null,"Premium 2 + 1/2 * Reserves 2","","","","","","",""]
[null,"Risk margin (RM)",{"$f":"'Risk vs exp Calc'!C624","v":""},{"$f":"'Risk vs exp Calc'!D624","v":""},{"$f":"'Risk vs exp Calc'!E624","v":""},"","","",""]
[null,"1:200 gross claims less 1:200 net claims [Note 5]",{"$f":"IFERROR('Risk vs exp Calc'!C88-'Risk vs exp Calc'!C85,\"\")","v":""},{"$f":"IFERROR('Risk vs exp Calc'!D88-'Risk vs exp Calc'!D85,\"\")","v":""},{"$f":"IFERROR('Risk vs exp Calc'!E88-'Risk vs exp Calc'!E85,\"\")","v":""},"","","","",null,null,null,null,null,null,null,null,null,null,null,null,null,null,null,null,null,null,"1:200 and mean","Simulation error"]
[null,"Available assets [Note 6]",{"$f":"IFERROR('Risk vs exp Calc'!C625-'Risk vs exp Calc'!C607+'Risk vs exp Calc'!C632,\"\")","v":""},{"$f":"IFERROR('Risk vs exp Calc'!D625-'Risk vs exp Calc'!D607+'Risk vs exp Calc'!D632,\"\")","v":""},{"$f":"IFERROR('Risk vs exp Calc'!E625-'Risk vs exp Calc'!E607+'Risk vs exp Calc'!E632,\"\")","v":""},"","","","",null,null,null,null,null,null,null,null,null,null,null,null,null,null,null,null,null,"Threshold",0.05,0.01]
[null,null,"B. ULTIMATE RISK"]
[null,"SCR "]
[null,"Mean",{"$f":"'Risk vs exp Calc'!C58","v":""},{"$f":"'Risk vs exp Calc'!D58","v":""},{"$f":"'Risk vs exp Calc'!E58","v":""},{"$f":"IFERROR(C18-D18,\"\")","v":""},{"$f":"IFERROR((C18-D18)/D18,\"\")","v":""},{"$f":"IFERROR(D18-E18,\"\")","v":""},{"$f":"IFERROR((D18-E18)/E18,\"\")","v":""},{"$f":"IFERROR(CONCATENATE(IF(OR(C18=\"\",D18=\"\"),\"\",IF(C18>0,IF(D18>0,$AB$20,$AB$19),\"\")),\" \",IF(OR(G27=\"\",G26=\"\"), \"\", IF(AND($G27<-$AC$15,($G26)>=$AC$15),$AB$21,IF(AND($G27<=$AC$15,$G26>$AC$15),$AB$22,\"\")))),\"\")","v":" "},{"$f":"IFERROR(CONCATENATE(IF(OR(D18=\"\",E18=\"\"),\"\",IF(D18>0,IF(E18>0,$AB$20,$AB$19),\"\")),\" \",IF(OR(I27=\"\",I26=\"\"), \"\", IF(AND($I27<-$AC$15,($I26)>=$AC$15),$AB$21,IF(AND($I27<=$AC$15,$I26>$AC$15),$AB$22,\"\")))),\"\")","v":" "},null,null,null,null,null,null,null,null,null,null,null,null,null,null,null,"ID","Conditions"]
[null,"SCR (submitted)",{"$f":"'Risk vs exp Calc'!C47","v":""},{"$f":"'Risk vs exp Calc'!D47","v":""},{"$f":"'Risk vs exp Calc'!E47","v":""},"","","","",null,null,null,null,null,null,null,null,null,null,null,null,null,null,null,null,null,1,"Mean value is a loss"]
[null,"Undiversified",{"$f":"'Risk vs exp Calc'!C40","v":""},{"$f":"'Risk vs exp Calc'!D40","v":""},{"$f":"'Risk vs exp Calc'!E40","v":""},"","","","",null,null,null,null,null,null,null,null,null,null,null,null,null,null,null,null,null,2,"Mean value was a loss in both the submission"]
[null,"Diversification credit (£)",{"$f":"IFERROR(C20-C19,\"\")","v":""},{"$f":"IFERROR(D20-D19,\"\")","v":""},"","","","","",null,null,null,null,null,null,null,null,null,null,null,null,null,null,null,null,null,3,"The 1:200 has decreased but the mean profit has not"]
[null,"Diversification credit (%)",{"$f":"IFERROR(C21/C20,\"\")","v":""},{"$f":"IFERROR(D21/D20,\"\")","v":""},"","","","","",null,null,null,null,null,null,null,null,null,null,null,null,null,null,null,null,null,4,"The 1:200 has not increased but the mean profit has"]
[null,"Loading [Note 7]",0,0,0,null,"",null,"",null,null,null,null,null,null,null,null,null,null,null,null,null,null,null,null,null,5,{"$f":"\"1:200 has decreased by more than \"&TEXT($AB$15,\"0%\")","v":"1:200 has decreased by more than 5%"}]
[null,"SCR (agreed)",{"$f":"IFERROR(C19+C23,\"\")","v":""},{"$f":"IFERROR(D19+D23,\"\")","v":""},"","","","","",null,null,null,null,null,null,null,null,null,null,null,null,null,null,null,null,null,6,{"$f":"\"1:200 has increased by more than \"&TEXT($AB$15,\"0%\")","v":"1:200 has increased by more than 5%"}]
[null,"SCR (agreed) + RM",{"$f":"IFERROR(C13+C24,\"\")","v":""},{"$f":"IFERROR(D13+D24,\"\")","v":""},{"$f":"IFERROR(E13+E24,\"\")","v":""},"","","","",null,null,null,null,null,null,null,null,null,null,null,null,null,null,null,null,null,7,"One year mean>ultimate mean"]
[null,"Mean vs. Premium 1 + 1/2 * Reserves 1",{"$f":"IFERROR(C18/C11,\"\")","v":""},{"$f":"IFERROR(D18/D11,\"\")","v":""},"",null,{"$f":"IFERROR((C26-D26)/D26,\"\")","v":""},null,"",{"$f":"IFERROR(IF(ABS($G26)>$AB$15,IF($G26>0,$AB$29,$AB$28),\"\"),\"\")","v":""},{"$f":"IFERROR(IF(ABS($I26)>$AB$15,IF($I26>0,$AB$29,$AB$28),\"\"),\"\")","v":""},null,null,null,null,null,null,null,null,null,null,null,null,null,null,null,8,"One year SCR has decreased compared to ultimate SCR"]
[null,"SCR (agreed) + RM vs. Premium 1 + 1/2 * Reserves 1",{"$f":"IFERROR(C25/(C11),\"\")","v":""},{"$f":"IFERROR(D25/(D11),\"\")","v":""},{"$f":"IFERROR(E25/(E11),\"\")","v":""},null,"",null,"",{"$f":"IFERROR(IF(ABS($G27)>$AB$15,IF($G27>0,$AB$24,$AB$23),\"\"),\"\")","v":""},{"$f":"IFERROR(IF(ABS($I27)>$AB$15,IF($I27>0,$AB$24,$AB$23),\"\"),\"\")","v":""},null,null,null,null,null,null,null,null,null,null,null,null,null,null,null,9,"One year SCR compared to ultimate SCR + risk margin is greater than 100%"]
[null,"SCR (agreed) + RM vs. Premium 2 + 1/2 * Reserves 2",{"$f":"IFERROR(C25/(C12),\"\")","v":""},{"$f":"IFERROR(D25/(D12),\"\")","v":""},{"$f":"IFERROR(E25/(E12),\"\")","v":""},null,"",null,"",null,null,null,null,null,null,null,null,null,null,null,null,null,null,null,null,null,10,{"$f":"\"Mean vs. exposure has decreased by more than \"&TEXT($AB$15,\"0%\")","v":"Mean vs. exposure has decreased by more than 5%"}]
[null,"Insurance risk",null,null,null,null,null,null,null,null,null,null,null,null,null,null,null,null,null,null,null,null,null,null,null,null,11,{"$f":"\"Mean vs. exposure has increased by more than \"&TEXT($AB$15,\"0%\")","v":"Mean vs. exposure has increased by more than 5%"}]
[null,"Mean",{"$f":"'Risk vs exp Calc'!C676","v":""},{"$f":"'Risk vs exp Calc'!D676","v":""},{"$f":"'Risk vs exp Calc'!E676","v":""},{"$f":"IFERROR(C30-D30,\"\")","v":""},{"$f":"IFERROR((C30-D30)/D30,\"\")","v":""},{"$f":"IFERROR(D30-E30,\"\")","v":""},{"$f":"IFERROR((D30-E30)/E30,\"\")","v":""},{"$f":"IFERROR(CONCATENATE(IF(OR(C30=\"\",D30=\"\"),\"\",IF(C30>0,IF(D30>0,$AB$20,$AB$19),\"\")),\" \",IF(OR(G37=\"\",G36=\"\"),\"\",IF(AND($G37<-$AC$15,($G36)>=$AC$15),$AB$21,IF(AND($G37<=$AC$15,$G36>$AC$15),$AB$22,\"\")))),\"\")","v":" "},{"$f":"IFERROR(CONCATENATE(IF(OR(D30=\"\",E30=\"\"),\"\",IF(D30>0,IF(E30>0,$AB$20,$AB$19),\"\")),\" \",IF(OR(I37=\"\",I36=\"\"),\"\",IF(AND($I37<-$AC$15,($I36)>=$AC$15),$AB$21,IF(AND($I37<=$AC$15,$I36>$AC$15),$AB$22,\"\")))),\"\")","v":" "}]
{"$rows_left_out":72}
{"sheet":"Risk vs exp Calc","index":4,"n_rows":1000,"n_cols":29,"rows_kept":1000,"cut":false,"hidden":true,"merged":[]}
[null,"This sheet collects raw CSV data for the four relevant reporting periods"]
[null,"The CSVs must be saved in the same folder as this file and must be named LCRs sXXX period A.xlsx, LCRs sXXX period B.xlsx, etc…"]
[null,"The links to CSVs are updated by a macro from a different sheet"]
[null,"All periods - summarised and v-lookupped",null,null,null,null,null,"CVS file A - straight dump",null,null,null,null,null,null,"CVS file B  - straight dump",null,null,null,null,null,null,"CVS file C - straight dump",null,null,null,null,null,null,"CVS file D - straight dump"]
[]
[null,{"$f":"Synd","v":0},"Reporting period A","Reporting period B","Reporting period C","Reporting period D",null,{"$f":"I6&K6&L6","v":""},null,null,null,null,null,null,{"$f":"P6&R6&S6","v":""},null,null,null,null,null,null,{"$f":"W6&Y6&Z6","v":""}]
[null,null,{"$f":"\"s\"&Synd&\" FORM 309\"","v":"s FORM 309"},null,null,null,null,{"$f":"I7&K7&L7","v":""},null,null,null,null,null,null,{"$f":"P7&R7&S7","v":""},null,null,null,null,null,null,{"$f":"W7&Y7&Z7","v":""}]
[null,null,null,null,null,null,null,{"$f":"I8&K8&L8","v":""},null,null,null,null,null,null,{"$f":"P8&R8&S8","v":""},null,null,null,null,null,null,""]
[null,null,"Headline",null,null,null,null,"",null,null,null,null,null,null,"",null,null,null,null,null,null,""]
["DiversifiedTotal_OneYrPostDiversification","One-Year Syndicate SCR Post Diversification ",{"$f":"IF(TEXT($B$6,\"0000\")=TEXT($L$6,\"0000\"),IFERROR(VLOOKUP($A10,file_1,3,0),\"\"),\"\")","v":""},{"$f":"IF(TEXT($B$6,\"0000\")=TEXT($S$6,\"0000\"),IFERROR(VLOOKUP($A10,file_2,3,0),\"\"),\"\")","v":""},{"$f":"IF(TEXT($B$6,\"0000\")=TEXT($Z$6,\"0000\"),IFERROR(VLOOKUP($A10,file_3,3,0),\"\"),\"\")","v":""},{"$f":"IF(TEXT($B$6,\"0000\")=TEXT($AG$6,\"0000\"),IFERROR(VLOOKUP($A10,file_4,3,0),\"\"),\"\")","v":""},null,"",null,null,null,null,null,null,"",null,null,null,null,null,null,""]
["DiversifiedTotal_UltPostDiversification","Ultimate Syndicate SCR Post Diversification ",{"$f":"IF(TEXT($B$6,\"0000\")=TEXT($L$6,\"0000\"),IFERROR(VLOOKUP($A11,file_1,3,0),\"\"),\"\")","v":""},{"$f":"IF(TEXT($B$6,\"0000\")=TEXT($S$6,\"0000\"),IFERROR(VLOOKUP($A11,file_2,3,0),\"\"),\"\")","v":""},{"$f":"IF(TEXT($B$6,\"0000\")=TEXT($Z$6,\"0000\"),IFERROR(VLOOKUP($A11,file_3,3,0),\"\"),\"\")","v":""},{"$f":"IF(TEXT($B$6,\"0000\")=TEXT($AG$6,\"0000\"),IFERROR(VLOOKUP($A11,file_4,3,0),\"\"),\"\")","v":""},null,"",null,null,null,null,null,null,"",null,null,null,null,null,null,""]
[null,null,null,null,null,null,null,"",null,null,null,null,null,null,"",null,null,null,null,null,null,""]
[null,null,"One-Year",null,null,null,null,"",null,null,null,null,null,null,"",null,null,null,null,null,null,""]
["PremiumReserveRisk_OneYrPreDiversification","One-Year total: After diversification between Premium and Reserve risk Pre Diversification ",{"$f":"IF(TEXT($B$6,\"0000\")=TEXT($L$6,\"0000\"),IFERROR(VLOOKUP($A14,file_1,3,0),\"\"),\"\")","v":""},{"$f":"IF(TEXT($B$6,\"0000\")=TEXT($S$6,\"0000\"),IFERROR(VLOOKUP($A14,file_2,3,0),\"\"),\"\")","v":""},{"$f":"IF(TEXT($B$6,\"0000\")=TEXT($Z$6,\"0000\"),IFERROR(VLOOKUP($A14,file_3,3,0),\"\"),\"\")","v":""},{"$f":"IF(TEXT($B$6,\"0000\")=TEXT($AG$6,\"0000\"),IFERROR(VLOOKUP($A14,file_4,3,0),\"\"),\"\")","v":""},null,"",null,null,null,null,null,null,"",null,null,null,null,null,null,""]
["PremiumRisk_OneYrPreDiversification","One-Year split: Premium Risk Pre Diversification ","","","","",null,"",null,null,null,null,null,null,"",null,null,null,null,null,null,""]
["ReserveRisk_OneYrPreDiversification","One-Year split: Reserve Risk Pre Diversification ","","","","",null,"",null,null,null,null,null,null,"",null,null,null,null,null,null,""]
["CreditRiskTotal_OneYrPreDiversification","One-Year total: After diversification between Reinsurance Credit Risk and Other Credit Risk Pre Diversification ","","","","",null,"",null,null,null,null,null,null,"",null,null,null,null,null,null,""]
["ReinsuranceCreditRisk_OneYrPreDiversification","One-Year split: Reinsurance Credit Risk Pre Diversification ","","","","",null,"",null,null,null,null,null,null,"",null,null,null,null,null,null,""]
["OtherCreditRisk_OneYrPreDiversification","One-Year split: Other Credit Risk Pre Diversification ","","","","",null,"",null,null,null,null,null,null,"",null,null,null,null,null,null,""]
["MarketRisk_OneYrPreDiversification","One-Year Market Risk Pre Diversification ","","","","",null,"",null,null,null,null,null,null,"",null,null,null,null,null,null,""]
["OperationalRisk_OneYrPreDiversification","One-Year Operational Risk Pre Diversification ","","","","",null,"",null,null,null,null,null,null,"",null,null,null,null,null,null,""]
["Total_OneYrPreDiversification_LCALC","One-Year TOTAL Pre Diversification ","","","","",null,"",null,null,null,null,null,null,"",null,null,null,null,null,null,""]
["PremiumReserveRisk_OneYrPostDiversification","One-Year total: After diversification between Premium and Reserve risk Post Diversification ","","","","",null,"",null,null,null,null,null,null,"",null,null,null,null,null,null,""]
["CreditRiskTotal_OneYrPostDiversification","One-Year total: After diversification between Reinsurance Credit Risk and Other Credit Risk Post Diversification ","","","","",null,"",null,null,null,null,null,null,"",null,null,null,null,null,null,""]
["MarketRisk_OneYrPostDiversification","One-Year Market Risk Post Diversification ","","","","",null,"",null,null,null,null,null,null,"",null,null,null,null,null,null,""]
["OperationalRisk_OneYrPostDiversification","One-Year Operational Risk Post Diversification ","","","","",null,"",null,null,null,null,null,null,"",null,null,null,null,null,null,""]
["Total_OneYrPostDiversification_LCALC","One-Year TOTAL Post Diversification ","","","","",null,"",null,null,null,null,null,null,"",null,null,null,null,null,null,""]
["DiversificationCredit_OneYrPreDiversification","One-Year Diversification credit between risk categories ","","","","",null,"",null,null,null,null,null,null,"",null,null,null,null,null,null,""]
["DiversifiedTotal_OneYrPostDiversification_LCALC","One-Year DIVERSIFIED TOTAL ","","","","",null,"",null,null,null,null,null,null,"",null,null,null,null,null,null,""]
[null,null,null,null,null,null,null,"",null,null,null,null,null,null,"",null,null,null,null,null,null,""]
{"$rows_left_out":970}